{"text_format":"1","workbook":"xlsx","n_sheets":7,"sheets":["ここからスタート！","コース全体","ガイダンスコンテンツ","授業コンテンツ と 自主的な活動を促すコンテンツ","確認結果シート","ガイドライン","lists"],"not_rendered":{"charts":0,"images":0,"macros":1,"external_links":0,"defined_names":22,"comments":0,"pivot_tables":0},"unopened":[],"bounds":{"document_bytes":16777216,"sheet_cells":100000,"rows_first":2000,"rows_last":500,"rows_between":2000,"halvings":0,"cell_chars":16384,"cell_head_chars":4096},"cells_cut":0,"cells_raw":0,"read":"whole","date_system":"1900"}

{"sheet":"ここからスタート！","index":0,"n_rows":23,"n_cols":5,"rows_kept":23,"cut":false,"hidden":false,"merged":[[2,2,2,5],[4,2,4,5]]}
["ここからスタート！"]
[]
[null,null,"記入の手引き"]
[]
[null,null,"本シートから記入を始め、「コース全体」「ガイダンスコンテンツ」「授業コンテンツと自主的な活動を促すコンテンツ」の各シートに順番に記入すると、自動的に「確認結果シート」に確認結果が入力されます。「確認結果シート」の内容を確認し、このエクセルファイル全体をご提出ください。"]
[]
[]
[null,null,"１．科目名等、コースの基本情報を黄色のセルに入力してください。"]
[null,null,null,"⇒黄色のセルは必須入力項目です。入力すると色が消えます。"]
[]
[null,null,null,null,"科目名（年度）"]
[null,null,null,null,"科目担当教員名（連絡先）"]
[null,null,null,null,"シート作成日"]
[null,null,null,null,"科目担当教員以外の確認者（名前・日付）"]
[]
[null,null,"２．「コース全体」シートに記入してください。"]
[null,null,null,null,"コース全体"]
[]
[null,null,"３．「ガイダンスコンテンツ」シートに記入してください。"]
[null,null,null,null,"ガイダンスコンテンツ"]
[]
[null,null,"４．「授業コンテンツと自主的な活動を促すコンテンツ」に記入してください。"]
[null,null,null,null,"授業コンテンツと自主的な活動を促すコンテンツ"]

{"sheet":"コース全体","index":1,"n_rows":33,"n_cols":5,"rows_kept":33,"cut":false,"hidden":false,"merged":[[7,4,7,5],[11,4,11,5],[12,4,12,5],[24,4,24,5],[14,3,14,5],[17,3,17,5],[20,3,20,5],[27,3,27,5],[28,4,28,5],[29,4,29,5],[25,4,25,5],[8,4,8,5],[15,4,15,5]]}
[{"$f":"確認結果シート!B10","v":"コース全体"}]
[]
[null,null,null,{"$f":"\"ガイドライン「\"&ガイドライン!A16&\"」(1)～(6)についての確認です。以下のセルにご記入ください。\"","v":"ガイドライン「４．ｅラーニングコンテンツを用いた授業設計」(1)～(6)についての確認です。以下のセルにご記入ください。"}]
[null,null,null,"⇒黄色のセルは必須入力項目、水色のセルはオプション入力項目です。入力すると色が消えます。"]
[]
[]
[null,null,"◆",{"$f":"確認結果シート!B11","v":"(1) １科目ごとに１コースを用いる。"}]
[null,null,null,null,"コースのURLを記入してください。\n※まだ設定されていない場合は、空白のままにしてください。"]
[]
[]
[null,null,"◆",{"$f":"確認結果シート!B12","v":"(2) １コースには一般的な対面授業の実施回数に相当するモジュール数を用いる。"}]
[null,null,null,null,"モジュール数（授業回数）を記入してください。"]
[]
[]
[null,null,"◆",{"$f":"確認結果シート!B13","v":"(3) 学修者にとって学びやすい環境を整えるため、各モジュールの学修に要する時間をおおむね揃える。[viii]"}]
[null,null,null,null,"⇒ここでは記入せずに「授業コンテンツと自主的な活動を促すコンテンツ」シートで記入します。"]
[]
[null,null,"◆",{"$f":"確認結果シート!B14","v":"(4) 数回分のまとめ学修を可能とするため、コンテンツの公開開始は数回分をまとめるか、あるいはブロック毎に定める。"}]
[null,null,null,null,"⇒ここでは記入せずに「ガイダンスコンテンツ」シートで記入します。"]
[]
[null,null,"◆",{"$f":"確認結果シート!B15","v":"(5) 数回分のまとめ学修を可能とするため、推奨学修期間を設けるか、学修期間（締切日時）を設定する。"}]
[null,null,null,null,"⇒ここでは記入せずに「ガイダンスコンテンツ」シートで記入します。"]
[]
[null,null,"◆",{"$f":"確認結果シート!B16","v":"(6) コース導入部分にはシラバスを示す。"}]
[null,null,null,null,"Moodleのコース上に知プラ５大学共通シラバスが掲載されていますか？\n※ない場合は、空白のままにしてください。"]
[]
[]
[null,null,"◆","※(1)～(6)についてコメントがあれば記入してください。"]
[null,null,null,null,"コメント"]
[]
[]
[]
[null,null,null,"⇒記入が終わったら「ガイダンスコンテンツ」シートへ進んでください。"]

{"sheet":"ガイダンスコンテンツ","index":2,"n_rows":83,"n_cols":8,"rows_kept":83,"cut":false,"hidden":false,"merged":[[77,3,77,5],[78,4,78,7],[79,4,79,7],[6,3,6,5],[12,3,12,5],[18,3,18,5],[59,4,59,5],[60,4,60,5],[9,4,9,5],[10,4,10,5],[19,4,19,5],[20,4,20,5],[13,4,13,5],[14,4,14,5],[15,4,15,5],[16,4,16,5],[21,4,21,5],[22,4,22,5],[27,4,27,5],[50,4,50,5],[49,4,49,6],[23,4,23,5],[24,4,24,5],[39,4,39,6],[36,4,36,5],[37,4,37,5],[26,3,26,5],[48,3,48,5],[46,6,46,7],[57,4,57,5],[58,4,58,5],[51,4,51,5],[52,4,52,5],[53,4,53,5],[56,3,56,5],[65,4,65,6],[67,4,67,6],[69,4,69,6],[71,4,71,6],[74,4,74,6]]}
[{"$f":"確認結果シート!B17","v":"ガイダンスコンテンツ"}]
[]
[null,null,null,{"$f":"\"ガイドライン「\"&ガイドライン!A16&\"」(7)～(8)についての確認です。以下のセルにご記入ください。\"","v":"ガイドライン「４．ｅラーニングコンテンツを用いた授業設計」(7)～(8)についての確認です。以下のセルにご記入ください。"}]
[null,null,null,"⇒黄色のセルは必須入力項目、水色のセルはオプション入力項目です。入力すると色が消えます。"]
[]
[]
[null,null,"◆",{"$f":"確認結果シート!B18","v":"(7) シラバスの内容を補完するため、次の要素を含むガイダンスコンテンツを示す。ただしガイダンスコンテンツは、科目特性や学修者特性に応じて、ブロックまたはモジュールの開始時に毎回示しても良い。"}]
[]
[null,null,"◆",{"$f":"確認結果シート!B19","v":"イ） ｅラーニング操作などについての問い合わせ先 "}]
[null,null,null,null,"Moodleのコース上に掲載した問い合わせ先を記入してください。\n※設定されていない場合は、空白のままにしてください。"]
[]
[]
[null,null,"◆",{"$f":"確認結果シート!B20","v":"ロ） 対面のオフィスアワー相当の、学修者が科目担当教員または補助員へ質問ができる手段（eメールアドレス、電子掲示板、指定時間に公開するチャットなど） "}]
[null,null,null,null,"Moodleのコース上に設定した質問手段を選んでください。\n※設定されていない場合は、空白のままにしてください。"]
[]
[null,null,null,null,"その他を選んだ場合の手段を記入してください。"]
[]
[]
[null,null,"◆",{"$f":"確認結果シート!B21","v":"ハ） 科目担当者による授業紹介（短編のイントロビデオ、または、写真と紹介文で、担当者の顔を見せ動機づけを促す目的を持つもの ）"}]
[null,null,null,null,"授業紹介の方法を選んでください。\n※設定されていない場合は、空白のままにしてください。"]
[]
[null,null,null,null,"イントロビデオの場合：長さを記入してください。"]
[]
[null,null,null,null,"その他を選んだ場合の手段を記入してください。"]
[]
[]
[null,null,"◆",{"$f":"確認結果シート!B22","v":"ニ） 授業概要（タイトル、学修の進め方、コンテンツの利用方法、教科書学習・ビデオ学習・ディスカッションなどの学修活動の実施方法 ）"}]
[null,null,null,null,"授業概要の中に以下の項目が書かれていますか?"]
[null,null,null,null,"タイトル"]
[null,null,null,null,"学修の進め方"]
[null,null,null,null,"コンテンツの利用方法"]
[null,null,null,null,"学修活動の実施方法"]
[null,null,null,null,"⇒以下の(表)詳細記入用に、「授業概要」の詳細をご記入ください。"]
[]
[null,null,"◆",{"$f":"確認結果シート!B23","v":"ホ） スケジュール（コンテンツの公開日時及び締切日時、推奨学修期間）"}]
[null,null,null,null,"※モジュールとブロックの関係については右図をご覧ください。"]
[null,null,null,null,"設定したブロック数を記入してください。"]
[]
[]
[null,null,null,null,"数回分のまとめ回、あるいは、ブロック毎の公開・終了日時、または、推奨学修期間を記入してください。\n例えば、２ブロック構成の場合は、３ブロック以降は空白のままにしてください。"]
[null,null,null,null,"ブロック\n（または、数回分のまとめ）","モジュール（授業の回）\n（例）１回～７回（まとめた数回分記入）","公開開始日時 or 推奨学修期間開始日時\n（例）2016/11/04 8:30","公開終了日時 or 推奨学修期間終了日時\n（例）2016/11/30 23:59"]
[null,null,null,null,"１ブロック"]
[null,null,null,null,"２ブロック"]
[null,null,null,null,"３ブロック"]
[null,null,null,null,"４ブロック"]
[null,null,null,null,"５ブロック"]
[null,null,null,null,"↑5つ以上ある場合は欄を追加してください。",null,"↑ガイドライン4(4)と4(5)に相当"]
[]
[null,null,"◆",{"$f":"確認結果シート!B24","v":"ヘ） 単位取得の条件（成績評価対象（複数）、各成績評価対象の評価基準（成績評価対象となる試験・レポート・作品課題などがそれぞれにおいて６割以上の点数を取得する必要がある旨、あるいは６割以上の基準点を定めた場合はその点数）、モジュール内の学修活動が出席に相当する旨）"}]
[null,null,null,null,"単位取得条件の中に以下の項目が書かれていますか？"]
[null,null,null,null,"成績評価対象（複数）"]
[null,null,null,null,"各成績評価対象の評価基準（６割以上の点数を取得する必要がある旨）"]
[null,null,null,null,"６割以上の基準点がある場合は基準点を記入"]
[null,null,null,null,"モジュール内の学修活動が出席に相当する旨"]
[null,null,null,null,"⇒以下の(表)詳細記入用に、「評価」の詳細をご記入ください。"]
[]
[null,null,"◆",{"$f":"確認結果シート!B25","v":"(8) ガイダンスコンテンツには必要に応じて、授業の前提知識の学修支援を目的とした学修活動コンテンツ（小テスト、小レポートなど）を含める。 "}]
[null,null,null,null,"前提知識の学修コンテンツはありますか？\n※設定されていない場合は、空白のままにしてください。"]
[]
[null,null,null,null,"ある場合は、小テスト、小レポートなどの方法を記入してください。"]
[]
[]
[null,null,"↓↓↓授業概要と評価について以下に詳細を記入してください。（図表を使用している場合は、画面キャプチャ等の画像でも結構です）↓↓↓"]
[null,null,null,null,"●授業概要"]
[null,null,null,null,"タイトル"]
[]
[null,null,null,null,"学修の進め方"]
[]
[null,null,null,null,"コンテンツの利用方法"]
[]
[null,null,null,null,"学修活動の実施方法"]
[]
[null,null,null,null,"●評価"]
[null,null,null,null,"成績評価対象と評価基準"]
[]
[]
[]
[null,null,"◆","※(7)～(8)についてコメントがあれば記入してください。"]
[null,null,null,null,"コメント"]
[]
[]
[]
[null,null,null,"⇒記入が終わったら「授業コンテンツと自主的な活動を促すコンテンツ」シートへ進んでください。"]

{"sheet":"授業コンテンツ と 自主的な活動を促すコンテンツ","index":3,"n_rows":292,"n_cols":10,"rows_kept":292,"cut":false,"hidden":false,"merged":[[44,7,44,9],[46,5,50,5],[51,5,55,5],[46,4,59,4],[59,6,59,9],[60,4,73,4],[60,5,64,5],[65,5,69,5],[73,6,73,9],[74,4,87,4],[74,5,78,5],[79,5,83,5],[87,6,87,9],[88,4,101,4],[88,5,92,5],[93,5,97,5],[101,6,101,9],[102,4,115,4],[102,5,106,5],[107,5,111,5],[115,6,115,9],[116,4,129,4],[116,5,120,5],[121,5,125,5],[129,6,129,9],[130,4,143,4],[130,5,134,5],[135,5,139,5],[143,6,143,9],[144,4,157,4],[144,5,148,5],[149,5,153,5],[157,6,157,9],[158,4,171,4],[158,5,162,5],[163,5,167,5],[171,6,171,9],[172,4,185,4],[172,5,176,5],[177,5,181,5],[185,6,185,9],[186,4,199,4],[186,5,190,5],[191,5,195,5],[199,6,199,9],[200,4,213,4],[200,5,204,5],[205,5,209,5],[213,6,213,9],[214,4,227,4],[214,5,218,5],[219,5,223,5],[227,6,227,9],[241,6,241,9],[242,4,255,4],[242,5,246,5],[247,5,251,5],[255,6,255,9],[287,4,287,9],[288,4,288,9],[6,3,6,9],[17,3,17,9],[28,3,28,10],[256,4,269,4],[256,5,260,5],[261,5,265,5],[269,6,269,9],[270,4,283,4],[270,5,274,5],[275,5,279,5],[283,6,283,9],[228,4,241,4],[228,5,232,5],[233,5,237,5],[9,4,9,6],[8,4,8,6],[13,4,13,6],[14,4,14,6],[18,4,18,6],[19,4,19,6],[24,4,24,6],[25,4,25,6],[44,4,45,6],[29,4,29,6],[30,4,30,6],[34,4,34,6],[35,4,35,6],[40,4,40,6],[41,4,41,6]]}
[{"$f":"確認結果シート!B26&\" と \"&確認結果シート!B31","v":"授業コンテンツ と 自主的な活動を促すコンテンツ"}]
[]
[null,null,null,{"$f":"\"ガイドライン「\"&ガイドライン!A16&\"」(9)～(10)および(3)についての確認です。以下のセルにご記入ください。\"","v":"ガイドライン「４．ｅラーニングコンテンツを用いた授業設計」(9)～(10)および(3)についての確認です。以下のセルにご記入ください。"}]
[null,null,null,"⇒黄色のセルは必須入力項目、水色のセルはオプション入力項目です。入力すると色が消えます。"]
[]
[]
[null,null,"◆",{"$f":"確認結果シート!B27","v":"(9) 学修者が主体的に学修活動を進められる環境を提供し、学修の達成を確認できるようにすることにより対面授業と同等の質を担保する。そのため、１モジュール（授業１回分）には以下の内容を含める。 "}]
[null,null,null,{"$f":"確認結果シート!B28","v":"イ） 授業内容（教科書などの情報コンテンツ）：文字、音声、動画、静止画など[ix] "}]
[null,null,null,null,"授業内容の主な形式は次のどれですか？"]
[]
[null,null,null,null,"⇒以下の(表)詳細記入用に、設定したすべての回について「授業内容」の詳細をご記入ください。"]
[]
[null,null,null,{"$f":"確認結果シート!B29","v":"ロ） 授業内容に関する双方向性を有した学修活動コンテンツ：小テスト、小レポート、電子掲示板など"}]
[null,null,null,null,"双方向性学習活動の主な形式は次のどれですか？"]
[]
[null,null,null,null,"⇒以下の(表)詳細記入用に、設定したすべての回について「双方向性学修活動」の詳細をご記入ください。"]
[]
[null,null,null,{"$f":"確認結果シート!B30","v":"ハ） 学修活動コンテンツの要件：合格条件（小テスト・小レポートの合格点など）、フィードバック方法（自動採点、手動採点、学生同士の相互フィードバック、教員・ティーチングアシスタントからの１件毎のフィードバック・まとめフィードバック、模範解答の掲示、解説など）、フィードバック実施期間の設定など "}]
[null,null,null,null,"双方向性学習活動の要件の主なフィードバック形式は次のどれですか？"]
[]
[null,null,null,null,"⇒以下の(表)詳細記入用に、設定したすべての回について「双方向性学修活動の要件」の詳細をご記入ください。"]
[]
[null,null,"◆",{"$f":"確認結果シート!B32","v":"(10) コース内には、授業外の自主的な学修を促すコンテンツを示す。自主的な学修を促すコンテンツには、以下の要素のいずれか１つ以上を含む。"}]
[null,null,null,{"$f":"確認結果シート!B33","v":"イ） 参考情報（リンク集、コラム、アドバイス、参考資料、文献一覧など）"}]
[null,null,null,null,"主な参考情報は次のどれですか？"]
[]
[null,null,null,null,"⇒以下の(表)詳細記入用に、設定したすべての回について「参考情報」の詳細をご記入ください。"]
[]
[null,null,null,{"$f":"確認結果シート!B34","v":"ロ） 授業内容についていけない学修者を対象とする復習の支援を目的とした学修活動コンテンツ（リンク集、コラム、アドバイス、参考資料、文献一覧、小テスト、小レポート、電子掲示板など） "}]
[null,null,null,null,"主な復習用の学修活動コンテンツは次のどれですか？"]
[]
[null,null,null,null,"⇒以下の(表)詳細記入用に、設定したすべての回について「復習」の詳細をご記入ください。"]
[]
[null,null,null,{"$f":"確認結果シート!B35","v":"ハ） 発展的な学修の支援を目的とした学修活動コンテンツ（リンク集、コラム、アドバイス、参考資料、文献一覧など）"}]
[null,null,null,null,"主な発展的な学修活動コンテンツは次のどれですか？"]
[]
[null,null,null,null,"⇒以下の(表)詳細記入用に、設定したすべての回について「発展学修」の詳細をご記入ください。"]
[]
[null,null,"◆",{"$f":"ガイドライン!A19","v":"(3) 学修者にとって学びやすい環境を整えるため、各モジュールの学修に要する時間をおおむね揃える。[viii]"}]
[null,null,null,null,"⇒下記の(表)詳細記入用に記入後、各回の学修時間がおおよそ揃っているか回答してください。"]
[null,null,null,null,"各回の学修時間はおおよそ揃っていますか？"]
[]
[]
[null,null,null,null,"↓↓↓設定したすべての授業回（モジュール）について以下に記入してください。↓↓↓"]
[null,null,null,null,"(表)詳細記入用",null,null,"(9)ハ）　双方向性学習活動の要件"]
[null,null,null,null,null,null,null,"(合格条件）","（フィードバック方法）","（フィードバック実施期間）"]
[null,null,null,null,"第１回","(9)イ）　授業内容\n（文字、音声、動画など）"]
[]
[]
[]
[]
[null,null,null,null,null,"(9)ロ）　双方向性学修活動\n（小テスト、電子掲示板など）"]
[]
[]
[]
[]
[null,null,null,null,null,"(10)イ）　参考情報"]
[null,null,null,null,null,"(10)ロ）　復習"]
[null,null,null,null,null,"(10)ハ）　発展学習"]
[null,null,null,null,null,"(3)おおよその学修時間\n（上記すべての合計時間）"]
[null,null,null,null,"第２回","(9)イ）　授業内容\n（文字、音声、動画など）"]
[]
[]
[]
[]
[null,null,null,null,null,"(9)ロ）　双方向性学修活動\n（小テスト、電子掲示板など）"]
[]
[]
[]
[]
[null,null,null,null,null,"(10)イ）　参考情報"]
[null,null,null,null,null,"(10)ロ）　復習"]
[null,null,null,null,null,"(10)ハ）　発展学習"]
[null,null,null,null,null,"(3)おおよその学修時間\n（上記すべての合計時間）"]
[null,null,null,null,"第３回","(9)イ）　授業内容\n（文字、音声、動画など）"]
[]
[]
[]
[]
[null,null,null,null,null,"(9)ロ）　双方向性学修活動\n（小テスト、電子掲示板など）"]
[]
[]
[]
[]
[null,null,null,null,null,"(10)イ）　参考情報"]
[null,null,null,null,null,"(10)ロ）　復習"]
[null,null,null,null,null,"(10)ハ）　発展学習"]
[null,null,null,null,null,"(3)おおよその学修時間\n（上記すべての合計時間）"]
[null,null,null,null,"第４回","(9)イ）　授業内容\n（文字、音声、動画など）"]
[]
[]
[]
[]
[null,null,null,null,null,"(9)ロ）　双方向性学修活動\n（小テスト、電子掲示板など）"]
[]
[]
[]
[]
[null,null,null,null,null,"(10)イ）　参考情報"]
[null,null,null,null,null,"(10)ロ）　復習"]
[null,null,null,null,null,"(10)ハ）　発展学習"]
[null,null,null,null,null,"(3)おおよその学修時間\n（上記すべての合計時間）"]
[null,null,null,null,"第５回","(9)イ）　授業内容\n（文字、音声、動画など）"]
[]
[]
[]
[]
[null,null,null,null,null,"(9)ロ）　双方向性学修活動\n（小テスト、電子掲示板など）"]
[]
[]
[]
[]
[null,null,null,null,null,"(10)イ）　参考情報"]
[null,null,null,null,null,"(10)ロ）　復習"]
[null,null,null,null,null,"(10)ハ）　発展学習"]
[null,null,null,null,null,"(3)おおよその学修時間\n（上記すべての合計時間）"]
[null,null,null,null,"第６回","(9)イ）　授業内容\n（文字、音声、動画など）"]
[]
[]
[]
[]
[null,null,null,null,null,"(9)ロ）　双方向性学修活動\n（小テスト、電子掲示板など）"]
[]
[]
[]
[]
[null,null,null,null,null,"(10)イ）　参考情報"]
[null,null,null,null,null,"(10)ロ）　復習"]
[null,null,null,null,null,"(10)ハ）　発展学習"]
[null,null,null,null,null,"(3)おおよその学修時間\n（上記すべての合計時間）"]
[null,null,null,null,"第７回","(9)イ）　授業内容\n（文字、音声、動画など）"]
[]
[]
[]
[]
[null,null,null,null,null,"(9)ロ）　双方向性学修活動\n（小テスト、電子掲示板など）"]
[]
[]
[]
[]
[null,null,null,null,null,"(10)イ）　参考情報"]
[null,null,null,null,null,"(10)ロ）　復習"]
[null,null,null,null,null,"(10)ハ）　発展学習"]
[null,null,null,null,null,"(3)おおよその学修時間\n（上記すべての合計時間）"]
[null,null,null,null,"第８回","(9)イ）　授業内容\n（文字、音声、動画など）"]
[]
[]
[]
[]
[null,null,null,null,null,"(9)ロ）　双方向性学修活動\n（小テスト、電子掲示板など）"]
[]
[]
[]
[]
[null,null,null,null,null,"(10)イ）　参考情報"]
[null,null,null,null,null,"(10)ロ）　復習"]
[null,null,null,null,null,"(10)ハ）　発展学習"]
[null,null,null,null,null,"(3)おおよその学修時間\n（上記すべての合計時間）"]
[null,null,null,null,"第９回","(9)イ）　授業内容\n（文字、音声、動画など）"]
[]
[]
[]
[]
[null,null,null,null,null,"(9)ロ）　双方向性学修活動\n（小テスト、電子掲示板など）"]
[]
[]
[]
[]
[null,null,null,null,null,"(10)イ）　参考情報"]
[null,null,null,null,null,"(10)ロ）　復習"]
[null,null,null,null,null,"(10)ハ）　発展学習"]
[null,null,null,null,null,"(3)おおよその学修時間\n（上記すべての合計時間）"]
[null,null,null,null,"第10回","(9)イ）　授業内容\n（文字、音声、動画など）"]
[]
[]
[]
[]
[null,null,null,null,null,"(9)ロ）　双方向性学修活動\n（小テスト、電子掲示板など）"]
[]
[]
[]
[]
[null,null,null,null,null,"(10)イ）　参考情報"]
[null,null,null,null,null,"(10)ロ）　復習"]
[null,null,null,null,null,"(10)ハ）　発展学習"]
[null,null,null,null,null,"(3)おおよその学修時間\n（上記すべての合計時間）"]
[null,null,null,null,"第11回","(9)イ）　授業内容\n（文字、音声、動画など）"]
[]
[]
[]
[]
[null,null,null,null,null,"(9)ロ）　双方向性学修活動\n（小テスト、電子掲示板など）"]
[]
[]
[]
[]
[null,null,null,null,null,"(10)イ）　参考情報"]
[null,null,null,null,null,"(10)ロ）　復習"]
[null,null,null,null,null,"(10)ハ）　発展学習"]
[null,null,null,null,null,"(3)おおよその学修時間\n（上記すべての合計時間）"]
{"$rows_left_out":93}
{"sheet":"確認結果シート","index":4,"n_rows":38,"n_cols":4,"rows_kept":38,"cut":false,"hidden":false,"merged":[[25,1,25,2],[30,1,30,2],[9,1,9,2],[16,1,16,2],[36,1,37,1],[8,1,8,2],[20,1,20,2],[21,1,21,2],[33,1,33,2],[34,1,34,2],[31,1,31,2],[32,1,32,2],[24,1,24,2],[28,1,28,2],[10,1,10,2],[22,1,22,2],[23,1,23,2],[29,1,29,2],[32,3,34,3],[27,1,27,2],[26,1,26,2],[1,1,1,3],[15,1,15,2],[17,1,17,2],[18,1,18,2],[19,1,19,2],[3,2,3,3],[4,2,4,3],[5,2,5,3],[6,2,6,3],[11,1,11,2],[12,1,12,2],[13,1,13,2],[14,1,14,2]]}
["確認結果シート"]
[null,{"$f":"ガイドライン!A1&\"準拠確認シート\"","v":"四国５大学連携による知のプラットフォーム形成事業「四国におけるe-Knowledge を基盤とした大学間連携による大学教育の共同実施」　オンライン授業設計ガイドライン準拠確認シート"}]
[]
[null,"科目名（年度）",{"$f":"'ここからスタート！'!F11","v":0}]
[null,"科目担当教員名（連絡先）",{"$f":"'ここからスタート！'!F12","v":0}]
[null,"シート作成日",{"$f":"'ここからスタート！'!F13","v":"00:00:00"}]
[null,"科目担当教員以外の確認者（名前・日付）",{"$f":"'ここからスタート！'!F14","v":0}]
[]
[null,{"$f":"\"「\"&ガイドライン!A16&\"」のチェック項目\"","v":"「４．ｅラーニングコンテンツを用いた授業設計」のチェック項目"},null,"確認結果"]
[null,"コース全体"]
[null,{"$f":"ガイドライン!A17","v":"(1) １科目ごとに１コースを用いる。"},null,{"$f":"IF(コース全体!E9=\"\",\"未達成\",\"達成\")","v":"未達成"}]
[null,{"$f":"ガイドライン!A18","v":"(2) １コースには一般的な対面授業の実施回数に相当するモジュール数を用いる。"},null,{"$f":"IF(コース全体!E13=\"\",\"未達成\",\"達成\")","v":"未達成"}]
[null,{"$f":"ガイドライン!A19","v":"(3) 学修者にとって学びやすい環境を整えるため、各モジュールの学修に要する時間をおおむね揃える。[viii]"},null,{"$f":"IF('授業コンテンツ と 自主的な活動を促すコンテンツ'!E42=lists!B80,\"達成\",\"未達成\")","v":"未達成"}]
[null,{"$f":"ガイドライン!A20","v":"(4) 数回分のまとめ学修を可能とするため、コンテンツの公開開始は数回分をまとめるか、あるいはブロック毎に定める。"},null,{"$f":"IF(AND(ガイダンスコンテンツ!G42<>\"\",ガイダンスコンテンツ!G43<>\"\"),\"達成\",\"未達成\")","v":"未達成"}]
[null,{"$f":"ガイドライン!A21","v":"(5) 数回分のまとめ学修を可能とするため、推奨学修期間を設けるか、学修期間（締切日時）を設定する。"},null,{"$f":"IF(AND(ガイダンスコンテンツ!H42<>\"\",ガイダンスコンテンツ!H43<>\"\"),\"達成\",\"未達成\")","v":"未達成"}]
[null,{"$f":"ガイドライン!A22","v":"(6) コース導入部分にはシラバスを示す。"},null,{"$f":"IF(コース全体!E26=lists!E10,\"達成\",\"未達成\")","v":"未達成"}]
[null,"ガイダンスコンテンツ"]
[null,{"$f":"ガイドライン!A23","v":"(7) シラバスの内容を補完するため、次の要素を含むガイダンスコンテンツを示す。ただしガイダンスコンテンツは、科目特性や学修者特性に応じて、ブロックまたはモジュールの開始時に毎回示しても良い。"}]
[null,{"$f":"ガイドライン!A24","v":"イ） ｅラーニング操作などについての問い合わせ先 "},null,{"$f":"IF(ガイダンスコンテンツ!E11=\"\",\"未達成\",\"達成\")","v":"未達成"}]
[null,{"$f":"ガイドライン!A25","v":"ロ） 対面のオフィスアワー相当の、学修者が科目担当教員または補助員へ質問ができる手段（eメールアドレス、電子掲示板、指定時間に公開するチャットなど） "},null,{"$f":"IF(ガイダンスコンテンツ!E15=\"\",\"未達成\",\"達成\")","v":"未達成"}]
[null,{"$f":"ガイドライン!A26","v":"ハ） 科目担当者による授業紹介（短編のイントロビデオ、または、写真と紹介文で、担当者の顔を見せ動機づけを促す目的を持つもの ）"},null,{"$f":"IF(ガイダンスコンテンツ!E21=\"\",\"未達成\",\"達成\")","v":"未達成"}]
[null,{"$f":"ガイドライン!A27","v":"ニ） 授業概要（タイトル、学修の進め方、コンテンツの利用方法、教科書学習・ビデオ学習・ディスカッションなどの学修活動の実施方法 ）"},null,{"$f":"IF(AND(ガイダンスコンテンツ!F29=lists!E10,ガイダンスコンテンツ!F30=lists!E10,ガイダンスコンテンツ!F31=lists!E10,ガイダンスコンテンツ!F32=lists!E10),\"達成\",\"未達成\")","v":"未達成"}]
[null,{"$f":"ガイドライン!A28","v":"ホ） スケジュール（コンテンツの公開日時及び締切日時、推奨学修期間）"},null,{"$f":"IF(COUNTA(ガイダンスコンテンツ!F42:H46)>5,\"達成\",\"未達成\")","v":"未達成"}]
[null,{"$f":"ガイドライン!A29","v":"ヘ） 単位取得の条件（成績評価対象（複数）、各成績評価対象の評価基準（成績評価対象となる試験・レポート・作品課題などがそれぞれにおいて６割以上の点数を取得する必要がある旨、あるいは６割以上の基準点を定めた場合はその点数）、モジュール内の学修活動が出席に相当する旨）"},null,{"$f":"IF(AND(ガイダンスコンテンツ!G51=lists!E10,ガイダンスコンテンツ!G52=lists!E10,ガイダンスコンテンツ!G54=lists!E10),\"達成\",\"未達成\")","v":"未達成"}]
[null,{"$f":"ガイドライン!A30","v":"(8) ガイダンスコンテンツには必要に応じて、授業の前提知識の学修支援を目的とした学修活動コンテンツ（小テスト、小レポートなど）を含める。 "},null,{"$f":"IF(ガイダンスコンテンツ!E59=\"\",\"未達成\",\"達成\")","v":"未達成"}]
[null,"授業コンテンツ"]
[null,{"$f":"ガイドライン!A31","v":"(9) 学修者が主体的に学修活動を進められる環境を提供し、学修の達成を確認できるようにすることにより対面授業と同等の質を担保する。そのため、１モジュール（授業１回分）には以下の内容を含める。 "}]
[null,{"$f":"ガイドライン!A32","v":"イ） 授業内容（教科書などの情報コンテンツ）：文字、音声、動画、静止画など[ix] "},null,{"$f":"IF(AND('授業コンテンツ と 自主的な活動を促すコンテンツ'!E10<>\"\",'授業コンテンツ と 自主的な活動を促すコンテンツ'!G47<>\"\",'授業コンテンツ と 自主的な活動を促すコンテンツ'!G61<>\"\",'授業コンテンツ と 自主的な活動を促すコンテンツ'!G75<>\"\"),\"達成\",\"未達成\")","v":"未達成"}]
[null,{"$f":"ガイドライン!A33","v":"ロ） 授業内容に関する双方向性を有した学修活動コンテンツ：小テスト、小レポート、電子掲示板など"},null,{"$f":"IF(AND('授業コンテンツ と 自主的な活動を促すコンテンツ'!E15<>\"\",'授業コンテンツ と 自主的な活動を促すコンテンツ'!G52<>\"\",'授業コンテンツ と 自主的な活動を促すコンテンツ'!G66<>\"\",'授業コンテンツ と 自主的な活動を促すコンテンツ'!G80<>\"\"),\"達成\",\"未達成\")","v":"未達成"}]
[null,{"$f":"ガイドライン!A34","v":"ハ） 学修活動コンテンツの要件：合格条件（小テスト・小レポートの合格点など）、フィードバック方法（自動採点、手動採点、学生同士の相互フィードバック、教員・ティーチングアシスタントからの１件毎のフィードバック・まとめフィードバック、模範解答の掲示、解説など）、フィードバック実施期間の設定など "},null,{"$f":"IF(AND('授業コンテンツ と 自主的な活動を促すコンテンツ'!E20<>\"\",'授業コンテンツ と 自主的な活動を促すコンテンツ'!H52<>\"\",'授業コンテンツ と 自主的な活動を促すコンテンツ'!H66<>\"\",'授業コンテンツ と 自主的な活動を促すコンテンツ'!H80<>\"\"),\"達成\",\"未達成\")","v":"未達成"}]
[null,"自主的な活動を促すコンテンツ"]
[null,{"$f":"ガイドライン!A35","v":"(10) コース内には、授業外の自主的な学修を促すコンテンツを示す。自主的な学修を促すコンテンツには、以下の要素のいずれか１つ以上を含む。"}]
[null,{"$f":"ガイドライン!A36","v":"イ） 参考情報（リンク集、コラム、アドバイス、参考資料、文献一覧など）"},null,{"$f":"IF(OR('授業コンテンツ と 自主的な活動を促すコンテンツ'!E26<>\"\",'授業コンテンツ と 自主的な活動を促すコンテンツ'!E31<>\"\",'授業コンテンツ と 自主的な活動を促すコンテンツ'!E36<>\"\"),\"達成\",\"未達成\")","v":"未達成"}]
[null,{"$f":"ガイドライン!A37","v":"ロ） 授業内容についていけない学修者を対象とする復習の支援を目的とした学修活動コンテンツ（リンク集、コラム、アドバイス、参考資料、文献一覧、小テスト、小レポート、電子掲示板など） "},null,{"$f":"IF(AND('授業コンテンツ と 自主的な活動を促すコンテンツ'!E20<>\"\",'授業コンテンツ と 自主的な活動を促すコンテンツ'!G57<>\"\",'授業コンテンツ と 自主的な活動を促すコンテンツ'!G71<>\"\",'授業コンテンツ と 自主的な活動を促すコンテンツ'!G85<>\"\"),\"達成\",\"未達成\")","v":"未達成"}]
[null,{"$f":"ガイドライン!A38","v":"ハ） 発展的な学修の支援を目的とした学修活動コンテンツ（リンク集、コラム、アドバイス、参考資料、文献一覧など）"},null,{"$f":"IF(AND('授業コンテンツ と 自主的な活動を促すコンテンツ'!E21<>\"\",'授業コンテンツ と 自主的な活動を促すコンテンツ'!G58<>\"\",'授業コンテンツ と 自主的な活動を促すコンテンツ'!G72<>\"\",'授業コンテンツ と 自主的な活動を促すコンテンツ'!G86<>\"\"),\"達成\",\"未達成\")","v":"未達成"}]
[]
[null,"合計数","達成",{"$f":"COUNTIF(D11:D16,C37)+COUNTIF(D19:D25,C37)+COUNTIF(D28:D30,C37)+COUNTIF(D33,C37)","v":0}]
[null,null,"未達成",{"$f":"COUNTIF(D11:D16,C38)+COUNTIF(D19:D25,C38)+COUNTIF(D28:D30,C38)+COUNTIF(D33,C38)","v":17}]

{"sheet":"ガイドライン","index":5,"n_rows":48,"n_cols":1,"rows_kept":48,"cut":false,"hidden":false,"merged":[]}
["四国５大学連携による知のプラットフォーム形成事業「四国におけるe-Knowledge を基盤とした大学間連携による大学教育の共同実施」　オンライン授業設計ガイドライン"]
[]
["１．ｅラーニングコンテンツの範囲"]
["(1) このガイドラインで取扱う「ｅラーニングコンテンツ（以下、「コンテンツ」という。）」とは、大学連携e-Learning 教育支援センター四国が知のプラットフォーム形成事業に関する教材を開発し、運用するものを指す。[i],[ii]"]
[]
["２．ｅラーニングコンテンツの定義"]
["(1) 単独で利用可能な最小単位の教材を「オブジェクト」という。[iii]"]
["(2) 複数オブジェクトを組み合わせて構成されたコンテンツ群を｢モジュール｣という。１モジュールは授業１回分に相当する。"]
["(3) 複数のモジュール、つまり授業数回分をまとめた単位を「ブロック」という。ブロックは、授業の構成を分かりやすく伝えるために科目構成に応じて用いる。[iv]"]
["(4) 複数のモジュールまたは複数のブロックで１コースを構成する。１コースとは、単位付与の基準に相当する学修活動を満たすモジュール（またはブロック）群のことである。[v]"]
[]
["３．成績判定"]
["(1) モジュールに含まれる学修活動[vi]は出席に相当する。全モジュール内の学修活動を一定以上[vii]実施・提出することで学業成績の判定要件を満たす。"]
["(2) 成績はモジュールに含まれる学修活動とそれ以外の学修成果（試験・レポート・作品課題など）の組み合わせで評価する。評価対象となる試験・レポート・作品課題などはそれぞれにおいて６割以上の点数を取得することで単位取得の最低条件とする。これによってすべての学修成果物で一定以上の成果を収めていることを確認する。"]
[]
["４．ｅラーニングコンテンツを用いた授業設計"]
["(1) １科目ごとに１コースを用いる。"]
["(2) １コースには一般的な対面授業の実施回数に相当するモジュール数を用いる。"]
["(3) 学修者にとって学びやすい環境を整えるため、各モジュールの学修に要する時間をおおむね揃える。[viii]"]
["(4) 数回分のまとめ学修を可能とするため、コンテンツの公開開始は数回分をまとめるか、あるいはブロック毎に定める。"]
["(5) 数回分のまとめ学修を可能とするため、推奨学修期間を設けるか、学修期間（締切日時）を設定する。"]
["(6) コース導入部分にはシラバスを示す。"]
["(7) シラバスの内容を補完するため、次の要素を含むガイダンスコンテンツを示す。ただしガイダンスコンテンツは、科目特性や学修者特性に応じて、ブロックまたはモジュールの開始時に毎回示しても良い。"]
["イ） ｅラーニング操作などについての問い合わせ先 "]
["ロ） 対面のオフィスアワー相当の、学修者が科目担当教員または補助員へ質問ができる手段（eメールアドレス、電子掲示板、指定時間に公開するチャットなど） "]
["ハ） 科目担当者による授業紹介（短編のイントロビデオ、または、写真と紹介文で、担当者の顔を見せ動機づけを促す目的を持つもの ）"]
["ニ） 授業概要（タイトル、学修の進め方、コンテンツの利用方法、教科書学習・ビデオ学習・ディスカッションなどの学修活動の実施方法 ）"]
["ホ） スケジュール（コンテンツの公開日時及び締切日時、推奨学修期間）"]
["ヘ） 単位取得の条件（成績評価対象（複数）、各成績評価対象の評価基準（成績評価対象となる試験・レポート・作品課題などがそれぞれにおいて６割以上の点数を取得する必要がある旨、あるいは６割以上の基準点を定めた場合はその点数）、モジュール内の学修活動が出席に相当する旨）"]
["(8) ガイダンスコンテンツには必要に応じて、授業の前提知識の学修支援を目的とした学修活動コンテンツ（小テスト、小レポートなど）を含める。 "]
["(9) 学修者が主体的に学修活動を進められる環境を提供し、学修の達成を確認できるようにすることにより対面授業と同等の質を担保する。そのため、１モジュール（授業１回分）には以下の内容を含める。 "]
["イ） 授業内容（教科書などの情報コンテンツ）：文字、音声、動画、静止画など[ix] "]
["ロ） 授業内容に関する双方向性を有した学修活動コンテンツ：小テスト、小レポート、電子掲示板など"]
["ハ） 学修活動コンテンツの要件：合格条件（小テスト・小レポートの合格点など）、フィードバック方法（自動採点、手動採点、学生同士の相互フィードバック、教員・ティーチングアシスタントからの１件毎のフィードバック・まとめフィードバック、模範解答の掲示、解説など）、フィードバック実施期間の設定など "]
["(10) コース内には、授業外の自主的な学修を促すコンテンツを示す。自主的な学修を促すコンテンツには、以下の要素のいずれか１つ以上を含む。"]
["イ） 参考情報（リンク集、コラム、アドバイス、参考資料、文献一覧など）"]
["ロ） 授業内容についていけない学修者を対象とする復習の支援を目的とした学修活動コンテンツ（リンク集、コラム、アドバイス、参考資料、文献一覧、小テスト、小レポート、電子掲示板など） "]
["ハ） 発展的な学修の支援を目的とした学修活動コンテンツ（リンク集、コラム、アドバイス、参考資料、文献一覧など）"]
[]
["[i] 知のプラットフォーム形成事業のシステム基盤を用いたとしても、共同実施ではなく、各大学が単独で実施する科目は対象外とする。"]
["[ii] フルオンライン以外の形態の授業におけるコンテンツの利用を妨げるものではない。ただし、利用に当たってはコンテンツの著作権者の許諾の範囲において利用する。"]
["[iii] VOD、PDFファイル、電子掲示板が設置されていた場合は、それぞれ単独で利用することが可能なため3オブジェクトとみなす。複数ファイルで構成することで意味のある教材として利用できる場合は、まとめて１オブジェクトとみなす（たとえば複数のHTML・CSS・画像ファイルなどで構成されるWebページ）。"]
["[iv] たとえば、１ブロックがモジュール１～５、２ブロックがモジュール６～10、3ブロックがモジュール11～15という３ブロックで構成する。"]
["[v] たとえば１単位を付与するのであれば、１コースには45時間の学修活動を行うことになるだけのモジュール数を用意する。"]
["[vi] ４．ｅラーニングコンテンツを用いた授業設計（９）ロを指す。"]
["[vii] 各大学または各学部において出席数に関する規則がある際は準拠する。"]
["[viii] たとえば対面授業で１単位の授業科目を15回で実施していた場合は、１コースに15回分のモジュールを用意し、１モジュールは３時間分の学修活動に相当するコンテンツを用意する。過度に負荷が高すぎたり、容易すぎたりするモジュールを用意しない。"]
["[ix] 具体的には、テキストファイル、VOD、PDFファイルなど。"]

{"sheet":"lists","index":6,"n_rows":81,"n_cols":5,"rows_kept":81,"cut":false,"hidden":false,"merged":[]}
["lists"]
["確認"]
[null,"達成"]
[null,"未達成"]
[null,"NA"]
["○×"]
[null,"○"]
[null,"×"]
["有無",null,null,"有"]
[null,"ある",null,null,"ある"]
[null,"ない"]
["授業問い合わせ先"]
[null,"eメールアドレス"]
[null,"電子掲示板"]
[null,"指定時間に公開するチャット"]
[null,"その他"]
["授業紹介"]
[null,"イントロビデオ"]
[null,"写真と紹介文"]
[null,"その他"]
["小"]
[null,"小テスト"]
[null,"小レポート"]
[null,"その他"]
["授業内容"]
[null,"文字（教科書やMoodle上に書かれた読み物など）"]
[null,"音声（声だけの解説など）"]
[null,"動画（スライドなどとともに行う解説など）"]
[null,"静止画（写真やイラストを中心とした解説など）"]
[null,"その他"]
["双方向性学修活動"]
[null,"小テスト"]
[null,"小レポート"]
[null,"電子掲示板"]
[null,"その他"]
["合格条件"]
[null,"合格条件を明示"]
[null,"合格条件は未設定"]
["フィードバック方法"]
[null,"自動採点"]
[null,"手動採点"]
[null,"学生同士の相互フィードバック"]
[null,"１件毎のフィードバック"]
[null,"まとめフィードバック"]
[null,"模範解答の掲示、解説"]
[null,"解説"]
["フィードバック実施期間"]
[null,"設定あり"]
[null,"設定なし"]
["参考情報"]
[null,"リンク集"]
[null,"コラム"]
[null,"アドバイス"]
[null,"参考資料"]
[null,"文献一覧"]
[null,"その他"]
["復習"]
[null,"リンク集"]
[null,"コラム"]
[null,"アドバイス"]
[null,"参考資料"]
[null,"文献一覧"]
[null,"小テスト"]
[null,"小レポート"]
[null,"電子掲示板"]
[null,"その他"]
["発展学修"]
[null,"リンク集"]
[null,"コラム"]
[null,"アドバイス"]
[null,"参考資料"]
[null,"文献一覧"]
[null,"その他"]
[]
["はいいいえ"]
[null,"はい"]
[null,"いいえ"]
[]
["揃う"]
[null,"おおよそ揃っている"]
[null,"揃っていない"]